Target
C-C chemokine receptor type 5
Ligand
BDBM50205754
Substrate
Meas. Tech.
ChEMBL_447183 (CHEMBL897483)
IC50
49±n/a nM
Citation
 Lu, SFChen, BDavey, DDunning, LJaroch, SMay, KOnuffer, JPhillips, GSubramanyam, BTseng, JLWei, RGWei, MYe, B CCR5 receptor antagonists: discovery and SAR of novel 4-hydroxypiperidine derivatives. Bioorg Med Chem Lett 17:1883-7 (2007)  
Target
Name:
C-C chemokine receptor type 5
Synonyms:
C-C CKR-5 CC-CKR-5 CCR5 CCR5_HUMAN CHEMR13 HIV-1 fusion coreceptor
Type:
Enzyme
Mol. Mass.:
40540.21
Organism:
Homo sapiens (Human)
Description:
P51681
Residue:
352
  
Inhibitor
Name:
BDBM50205754
Synonyms:
1-(2-(4-chlorobenzyloxy)-5-bromobenzyl)piperidin-4-ol | CHEMBL392659
Type:
Small organic molecule
Emp. Form.:
C19H21BrClNO2
Mol. Mass.:
410.733
SMILES:
OC1CCN(Cc2cc(Br)ccc2OCc2ccc(Cl)cc2)CC1
: