Target
D(3) dopamine receptor
Ligand
BDBM50206002
Substrate
Meas. Tech.
ChEMBL_442468 (CHEMBL892633)
Ki
2.1±n/a nM
Citation
 Jung, JYJung, SHKoh, HY Asymmetric synthesis of chiral piperazinylpropylisoxazoline ligands for dopamine receptors. Eur J Med Chem 42:1044-8 (2007)  
Target
Name:
D(3) dopamine receptor
Synonyms:
DOPAMINE D3 DRD3_HUMAN Dopamine D3 receptor (D3) Dopamine receptor Dopamine receptor D3
Type:
Mol. Mass.:
44243.43
Organism:
Homo sapiens (Human)
Description:
Residue:
400
  
Inhibitor
Name:
BDBM50206002
Synonyms:
(R)-1-(bis(4-fluorophenyl)methyl)-4-(3-(3-(3,4-dimethoxyphenyl)-4,5-dihydroisoxazol-5-yl)propyl)piperazine | CHEMBL243012
Type:
Small organic molecule
Emp. Form.:
C31H35F2N3O3
Mol. Mass.:
535.6247
SMILES:
COc1ccc(cc1OC)C1=NO[C@H](CCCN2CCN(CC2)C(c2ccc(F)cc2)c2ccc(F)cc2)C1
: