Target
D(3) dopamine receptor
Ligand
BDBM50206004
Substrate
Meas. Tech.
ChEMBL_442468 (CHEMBL892633)
Ki
2.1±n/a nM
Citation
 Jung, JYJung, SHKoh, HY Asymmetric synthesis of chiral piperazinylpropylisoxazoline ligands for dopamine receptors. Eur J Med Chem 42:1044-8 (2007)  
Target
Name:
D(3) dopamine receptor
Synonyms:
DOPAMINE D3 DRD3_HUMAN Dopamine D3 receptor (D3) Dopamine receptor Dopamine receptor D3
Type:
Mol. Mass.:
44243.43
Organism:
Homo sapiens (Human)
Description:
Residue:
400
  
Inhibitor
Name:
BDBM50206004
Synonyms:
(R)-1-(3-(3-(3,4-dimethoxyphenyl)-4,5-dihydroisoxazol-5-yl)propyl)-4-(2-ethoxyphenyl)piperazine | CHEMBL243224
Type:
Small organic molecule
Emp. Form.:
C26H35N3O4
Mol. Mass.:
453.5738
SMILES:
CCOc1ccccc1N1CCN(CCC[C@@H]2CC(=NO2)c2ccc(OC)c(OC)c2)CC1
: