Target
Androgen receptor
Ligand
BDBM50206599
Substrate
Meas. Tech.
ChEMBL_428792 (CHEMBL916225)
Kd
110±n/a nM
Citation
 Parent, EEDence, CSJenks, CSharp, TLWelch, MJKatzenellenbogen, JA Synthesis and biological evaluation of [18F]bicalutamide, 4-[76Br]bromobicalutamide, and 4-[76Br]bromo-thiobicalutamide as non-steroidal androgens for prostate cancer imaging. J Med Chem 50:1028-40 (2007)  
Target
Name:
Androgen receptor
Synonyms:
ANDR_RAT Ar Nr3c4 | androgen
Type:
Enzyme
Mol. Mass.:
98219.08
Organism:
Rattus norvegicus (Rat)
Description:
P15207
Residue:
902
  
Inhibitor
Name:
BDBM50206599
Synonyms:
3-(4-bromo-benzenesulfonyl)-N-(4-cyano-3-trifluoromethylphenyl)--2-hydroxy-2-methyl-propionamide | CHEMBL373461
Type:
Small organic molecule
Emp. Form.:
C18H14BrF3N2O4S
Mol. Mass.:
491.279
SMILES:
CC(O)(CS(=O)(=O)c1ccc(Br)cc1)C(=O)Nc1ccc(C#N)c(c1)C(F)(F)F
: