Target
Phospholipase A2, membrane associated
Ligand
BDBM50206909
Substrate
Meas. Tech.
ChEMBL_428851 (CHEMBL917127)
IC50
30500±n/a nM
Citation
 Touaibia, MDjimdé, ACao, FBoilard, EBezzine, SLambeau, GRedeuilh, CLamouri, AMassicot, FChau, FDong, CZHeymans, F Inhibition of secreted phospholipase A2. 4-glycerol derivatives of 4,5-dihydro-3-(4-tetradecyloxybenzyl)-1,2,4-4H-oxadiazol-5-one with broad activities. J Med Chem 50:1618-26 (2007)  
Target
Name:
Phospholipase A2, membrane associated
Synonyms:
GIIC sPLA2 NPS-PLA2 Non-pancreatic secretory phospholipase A2 (hnps-PLA2) PLA2B PLA2L Phospholipase A2 group IIA | RASF-A
Type:
Hydrolase
Mol. Mass.:
16101.20
Organism:
Homo sapiens (Human)
Description:
The human nps PLA2 was cloned, and expressed in E. coli. There was a refolding process in the purification.
Residue:
144
  
Inhibitor
Name:
BDBM50206909
Synonyms:
1,3-O-di[4-(4,5-dihydro-5-oxo-4H-1,2,4-oxadiazol-3-yl)methylphenyl]-2-O-pentylglycerol | CHEMBL376244
Type:
Small organic molecule
Emp. Form.:
C26H30N4O7
Mol. Mass.:
510.539
SMILES:
CCCCCOC(COc1ccc(Cc2nc(=O)o[nH]2)cc1)COc1ccc(Cc2nc(=O)o[nH]2)cc1
: