Target
Delta-type opioid receptor
Ligand
BDBM50207830
Substrate
Meas. Tech.
ChEMBL_455040 (CHEMBL887069)
Ki
1.2±n/a nM
Citation
 Dolle, REMichaut, MMartinez-Teipel, BBelanger, SGraczyk, TMDeHaven, RN Further studies of tyrosine surrogates in opioid receptor peptide ligands. Bioorg Med Chem Lett 17:2656-60 (2007)  
Target
Name:
Delta-type opioid receptor
Synonyms:
D-OR-1 Delta opioid receptor OPIATE Delta OPRD1 OPRK1 | opioid receptor, delta 1
Type:
G Protein-Coupled Receptor (GPCR)
Mol. Mass.:
40382.98
Organism:
Homo sapiens (Human)
Description:
Competition binding assays were carried out using membrane preparations from transfected HN9.10 cells that constitutively expressed the delta opioid receptor.
Residue:
372
  
Inhibitor
Name:
BDBM50207830
Synonyms:
CHEMBL247760 | H-Cdp-ser-Gly-Phe-Leu-Thr-OH
Type:
Small organic molecule
Emp. Form.:
C36H51N7O10
Mol. Mass.:
741.831
SMILES:
CC(C)C[C@H](NC(=O)[C@H](Cc1ccccc1)NC(=O)CNC(=O)[C@H](CO)NC(=O)[C@@H](N)Cc1c(C)cc(cc1C)C(N)=O)C(=O)N[C@@H]([C@@H](C)O)C(O)=O
: