Target
Matrix metalloproteinase-9
Ligand
BDBM50208342
Substrate
Meas. Tech.
ChEMBL_438534 (CHEMBL887633)
Ki
>2128±n/a nM
Citation
 Sheppeck, JEGilmore, JLTebben, AXue, CBLiu, RQDecicco, CPDuan, JJ Hydantoins, triazolones, and imidazolones as selective non-hydroxamate inhibitors of tumor necrosis factor-alpha converting enzyme (TACE). Bioorg Med Chem Lett 17:2769-74 (2007)  
Target
Name:
Matrix metalloproteinase-9
Synonyms:
67 kDa matrix metalloproteinase-9 92 kDa gelatinase CLG4B Gelatinase B MMP9 Matrix metalloproteinase 9 (MMP-9) Matrix metalloproteinase-9 (MMP9)
Type:
Enzyme
Mol. Mass.:
78452.28
Organism:
Homo sapiens (Human)
Description:
P14780
Residue:
707
  
Inhibitor
Name:
BDBM50208342
Synonyms:
CHEMBL388124 | N-((4-methyl-2,5-dioxoimidazolidin-4-yl)methyl)-4-((2-methylquinolin-4-yl)methoxy)benzenesulfonamide
Type:
Small organic molecule
Emp. Form.:
C22H22N4O5S
Mol. Mass.:
454.499
SMILES:
Cc1cc(COc2ccc(cc2)S(=O)(=O)NCC2(C)NC(=O)NC2=O)c2ccccc2n1
: