Target
72 kDa type IV collagenase
Ligand
BDBM50208340
Substrate
Meas. Tech.
ChEMBL_438528 (CHEMBL887627)
Ki
>3333±n/a nM
Citation
 Sheppeck, JEGilmore, JLTebben, AXue, CBLiu, RQDecicco, CPDuan, JJ Hydantoins, triazolones, and imidazolones as selective non-hydroxamate inhibitors of tumor necrosis factor-alpha converting enzyme (TACE). Bioorg Med Chem Lett 17:2769-74 (2007)  
Target
Name:
72 kDa type IV collagenase
Synonyms:
72 kDa gelatinase CLG4A Gelatinase A (MMP-2) MMP2_HUMAN Matrix metalloproteinase-2 (MMP 2) Matrix metalloproteinases 2 (MMP-2) | TBE-1
Type:
Enzyme
Mol. Mass.:
73870.36
Organism:
Homo sapiens (Human)
Description:
P08253
Residue:
660
  
Inhibitor
Name:
BDBM50208340
Synonyms:
4-((2-methylquinolin-4-yl)methoxy)-N-(2-(2-oxo-2,3-dihydro-1H-imidazole-4-carbonyl)phenyl)benzamide CHEMBL228320
Type:
Small organic molecule
Emp. Form.:
C28H22N4O4
Mol. Mass.:
478.4987
SMILES:
Cc1cc(COc2ccc(cc2)C(=O)Nc2ccccc2C(=O)c2c[nH]c(=O)[nH]2)c2ccccc2n1
: