Target
Collagenase 3
Ligand
BDBM50208341
Substrate
Meas. Tech.
ChEMBL_438532 (CHEMBL887631)
Ki
>5025±n/a nM
Citation
 Sheppeck, JEGilmore, JLTebben, AXue, CBLiu, RQDecicco, CPDuan, JJ Hydantoins, triazolones, and imidazolones as selective non-hydroxamate inhibitors of tumor necrosis factor-alpha converting enzyme (TACE). Bioorg Med Chem Lett 17:2769-74 (2007)  
Target
Name:
Collagenase 3
Synonyms:
MMP-13 MMP13_HUMAN Matrix metalloproteinase-13 (MMP-13) | Matrix metalloproteinase-13 (MMP13)
Type:
Enzyme
Mol. Mass.:
53808.06
Organism:
Homo sapiens (Human)
Description:
P45452
Residue:
471
  
Inhibitor
Name:
BDBM50208341
Synonyms:
4-((2-methylquinolin-4-yl)methoxy)-N-((5-oxo-4,5-dihydro-1H-1,2,4-triazol-3-yl)methyl)benzenesulfonamide | CHEMBL228268
Type:
Small organic molecule
Emp. Form.:
C20H19N5O4S
Mol. Mass.:
425.461
SMILES:
Cc1cc(COc2ccc(cc2)S(=O)(=O)NCc2n[nH]c(=O)[nH]2)c2ccccc2n1
: