Target
Matrilysin
Ligand
BDBM26526
Substrate
Meas. Tech.
ChEMBL_438530 (CHEMBL887629)
Ki
259±n/a nM
Citation
 Sheppeck, JEGilmore, JLTebben, AXue, CBLiu, RQDecicco, CPDuan, JJ Hydantoins, triazolones, and imidazolones as selective non-hydroxamate inhibitors of tumor necrosis factor-alpha converting enzyme (TACE). Bioorg Med Chem Lett 17:2769-74 (2007)  
Target
Name:
Matrilysin
Synonyms:
MMP7 MPSL1 Matrix metalloproteinase-7 (MMP-7) PUMP1
Type:
Enzyme
Mol. Mass.:
29681.54
Organism:
Homo sapiens (Human)
Description:
P09237
Residue:
267
  
Inhibitor
Name:
BDBM26526
Synonyms:
(2R)-N-hydroxy-2-[(3S)-3-methyl-3-{4-[(2-methylquinolin-4-yl)methoxy]phenyl}-2-oxopyrrolidin-1-yl]propanamide CHEMBL148169 | IK682
Type:
Small organic molecule
Emp. Form.:
C25H27N3O4
Mol. Mass.:
433.4996
SMILES:
C[C@@H](N1CC[C@](C)(C1=O)c1ccc(OCc2cc(C)nc3ccccc23)cc1)C(=O)NO
: