Target
Interstitial collagenase
Ligand
BDBM50201248
Substrate
Meas. Tech.
ChEMBL_438533 (CHEMBL887632)
Ki
>4946±n/a nM
Citation
 Sheppeck, JEGilmore, JLTebben, AXue, CBLiu, RQDecicco, CPDuan, JJ Hydantoins, triazolones, and imidazolones as selective non-hydroxamate inhibitors of tumor necrosis factor-alpha converting enzyme (TACE). Bioorg Med Chem Lett 17:2769-74 (2007)  
Target
Name:
Interstitial collagenase
Synonyms:
CLG MMP1 Matrix metalloproteinase-1 | Matrix metalloproteinase-1 (MMP-1)
Type:
Enzyme
Mol. Mass.:
54010.26
Organism:
Homo sapiens (Human)
Description:
P03956
Residue:
469
  
Inhibitor
Name:
BDBM50201248
Synonyms:
CHEMBL229070 | N-((4-methyl-2,5-dioxoimidazolidin-4-yl)methyl)-4-((2-methylquinolin-4-yl)methoxy)benzamide
Type:
Small organic molecule
Emp. Form.:
C23H22N4O4
Mol. Mass.:
418.4452
SMILES:
Cc1cc(COc2ccc(cc2)C(=O)NCC2(C)NC(=O)NC2=O)c2ccccc2n1
: