Target
Macrophage metalloelastase
Ligand
BDBM50201248
Substrate
Meas. Tech.
ChEMBL_438531 (CHEMBL887630)
Ki
>5025±n/a nM
Citation
 Sheppeck, JEGilmore, JLTebben, AXue, CBLiu, RQDecicco, CPDuan, JJ Hydantoins, triazolones, and imidazolones as selective non-hydroxamate inhibitors of tumor necrosis factor-alpha converting enzyme (TACE). Bioorg Med Chem Lett 17:2769-74 (2007)  
Target
Name:
Macrophage metalloelastase
Synonyms:
HME MMP12_HUMAN Matrix metalloproteinase-12 (MMP 12) Matrix metalloproteinase-12 (MMP12) | Matrix metalloproteinases 12 (MMP-12)
Type:
Enzyme
Mol. Mass.:
54012.99
Organism:
Homo sapiens (Human)
Description:
P39900
Residue:
470
  
Inhibitor
Name:
BDBM50201248
Synonyms:
CHEMBL229070 | N-((4-methyl-2,5-dioxoimidazolidin-4-yl)methyl)-4-((2-methylquinolin-4-yl)methoxy)benzamide
Type:
Small organic molecule
Emp. Form.:
C23H22N4O4
Mol. Mass.:
418.4452
SMILES:
Cc1cc(COc2ccc(cc2)C(=O)NCC2(C)NC(=O)NC2=O)c2ccccc2n1
: