Target
Interstitial collagenase
Ligand
BDBM50208345
Substrate
Meas. Tech.
ChEMBL_438533 (CHEMBL887632)
Ki
>4946±n/a nM
Citation
 Sheppeck, JEGilmore, JLTebben, AXue, CBLiu, RQDecicco, CPDuan, JJ Hydantoins, triazolones, and imidazolones as selective non-hydroxamate inhibitors of tumor necrosis factor-alpha converting enzyme (TACE). Bioorg Med Chem Lett 17:2769-74 (2007)  
Target
Name:
Interstitial collagenase
Synonyms:
CLG MMP1 Matrix metalloproteinase-1 | Matrix metalloproteinase-1 (MMP-1)
Type:
Enzyme
Mol. Mass.:
54010.26
Organism:
Homo sapiens (Human)
Description:
P03956
Residue:
469
  
Inhibitor
Name:
BDBM50208345
Synonyms:
4-((2-methylquinolin-4-yl)methoxy)-N-((5-oxo-4,5-dihydro-1H-1,2,4-triazol-3-yl)methyl)benzamide | CHEMBL228267
Type:
Small organic molecule
Emp. Form.:
C21H19N5O3
Mol. Mass.:
389.4073
SMILES:
Cc1cc(COc2ccc(cc2)C(=O)NCc2n[nH]c(=O)[nH]2)c2ccccc2n1
: