Target
Disintegrin and metalloproteinase domain-containing protein 17
Ligand
BDBM50208347
Substrate
Meas. Tech.
ChEMBL_438527 (CHEMBL887626)
IC50
14±n/a nM
Citation
 Sheppeck, JEGilmore, JLTebben, AXue, CBLiu, RQDecicco, CPDuan, JJ Hydantoins, triazolones, and imidazolones as selective non-hydroxamate inhibitors of tumor necrosis factor-alpha converting enzyme (TACE). Bioorg Med Chem Lett 17:2769-74 (2007)  
Target
Name:
Disintegrin and metalloproteinase domain-containing protein 17
Synonyms:
ADA17_HUMAN CSVP Disintegrin and metalloproteinase domain-containing protein 17 (ADAM17) TNF-alpha convertase TNF-alpha-converting enzyme (TACE) Tumor necrosis factor-α converting enzyme (TACE)
Type:
Enzyme
Mol. Mass.:
93007.89
Organism:
Homo sapiens (Human)
Description:
Residue:
824
  
Inhibitor
Name:
BDBM50208347
Synonyms:
CHEMBL229072 | N-(2-(2,5-dioxoimidazolidin-4-yl)phenyl)-4-((2-methylquinolin-4-yl)methoxy)benzamide
Type:
Small organic molecule
Emp. Form.:
C27H22N4O4
Mol. Mass.:
466.488
SMILES:
Cc1cc(COc2ccc(cc2)C(=O)Nc2ccccc2-c2[nH]c(=O)[nH]c2O)c2ccccc2n1
: