Target
Macrophage metalloelastase
Ligand
BDBM50208341
Substrate
Meas. Tech.
ChEMBL_438531 (CHEMBL887630)
Ki
4120±n/a nM
Citation
 Sheppeck, JEGilmore, JLTebben, AXue, CBLiu, RQDecicco, CPDuan, JJ Hydantoins, triazolones, and imidazolones as selective non-hydroxamate inhibitors of tumor necrosis factor-alpha converting enzyme (TACE). Bioorg Med Chem Lett 17:2769-74 (2007)  
Target
Name:
Macrophage metalloelastase
Synonyms:
HME MMP12_HUMAN Matrix metalloproteinase-12 (MMP 12) Matrix metalloproteinase-12 (MMP12) | Matrix metalloproteinases 12 (MMP-12)
Type:
Enzyme
Mol. Mass.:
54012.99
Organism:
Homo sapiens (Human)
Description:
P39900
Residue:
470
  
Inhibitor
Name:
BDBM50208341
Synonyms:
4-((2-methylquinolin-4-yl)methoxy)-N-((5-oxo-4,5-dihydro-1H-1,2,4-triazol-3-yl)methyl)benzenesulfonamide | CHEMBL228268
Type:
Small organic molecule
Emp. Form.:
C20H19N5O4S
Mol. Mass.:
425.461
SMILES:
Cc1cc(COc2ccc(cc2)S(=O)(=O)NCc2n[nH]c(=O)[nH]2)c2ccccc2n1
: