Target
Disintegrin and metalloproteinase domain-containing protein 17
Ligand
BDBM50208340
Substrate
Meas. Tech.
ChEMBL_438527 (CHEMBL887626)
IC50
9±n/a nM
Citation
 Sheppeck, JEGilmore, JLTebben, AXue, CBLiu, RQDecicco, CPDuan, JJ Hydantoins, triazolones, and imidazolones as selective non-hydroxamate inhibitors of tumor necrosis factor-alpha converting enzyme (TACE). Bioorg Med Chem Lett 17:2769-74 (2007)  
Target
Name:
Disintegrin and metalloproteinase domain-containing protein 17
Synonyms:
ADA17_HUMAN CSVP Disintegrin and metalloproteinase domain-containing protein 17 (ADAM17) TNF-alpha convertase TNF-alpha-converting enzyme (TACE) Tumor necrosis factor-α converting enzyme (TACE)
Type:
Enzyme
Mol. Mass.:
93007.89
Organism:
Homo sapiens (Human)
Description:
Residue:
824
  
Inhibitor
Name:
BDBM50208340
Synonyms:
4-((2-methylquinolin-4-yl)methoxy)-N-(2-(2-oxo-2,3-dihydro-1H-imidazole-4-carbonyl)phenyl)benzamide CHEMBL228320
Type:
Small organic molecule
Emp. Form.:
C28H22N4O4
Mol. Mass.:
478.4987
SMILES:
Cc1cc(COc2ccc(cc2)C(=O)Nc2ccccc2C(=O)c2c[nH]c(=O)[nH]2)c2ccccc2n1
: