Target
72 kDa type IV collagenase
Ligand
BDBM50208341
Substrate
Meas. Tech.
ChEMBL_438528 (CHEMBL887627)
Ki
2472±n/a nM
Citation
 Sheppeck, JEGilmore, JLTebben, AXue, CBLiu, RQDecicco, CPDuan, JJ Hydantoins, triazolones, and imidazolones as selective non-hydroxamate inhibitors of tumor necrosis factor-alpha converting enzyme (TACE). Bioorg Med Chem Lett 17:2769-74 (2007)  
Target
Name:
72 kDa type IV collagenase
Synonyms:
72 kDa gelatinase CLG4A Gelatinase A (MMP-2) MMP2_HUMAN Matrix metalloproteinase-2 (MMP 2) Matrix metalloproteinases 2 (MMP-2) | TBE-1
Type:
Enzyme
Mol. Mass.:
73870.36
Organism:
Homo sapiens (Human)
Description:
P08253
Residue:
660
  
Inhibitor
Name:
BDBM50208341
Synonyms:
4-((2-methylquinolin-4-yl)methoxy)-N-((5-oxo-4,5-dihydro-1H-1,2,4-triazol-3-yl)methyl)benzenesulfonamide | CHEMBL228268
Type:
Small organic molecule
Emp. Form.:
C20H19N5O4S
Mol. Mass.:
425.461
SMILES:
Cc1cc(COc2ccc(cc2)S(=O)(=O)NCc2n[nH]c(=O)[nH]2)c2ccccc2n1
: