Target
Matrilysin
Ligand
BDBM50208344
Substrate
Meas. Tech.
ChEMBL_438530 (CHEMBL887629)
Ki
>6368±n/a nM
Citation
 Sheppeck, JEGilmore, JLTebben, AXue, CBLiu, RQDecicco, CPDuan, JJ Hydantoins, triazolones, and imidazolones as selective non-hydroxamate inhibitors of tumor necrosis factor-alpha converting enzyme (TACE). Bioorg Med Chem Lett 17:2769-74 (2007)  
Target
Name:
Matrilysin
Synonyms:
MMP7 MPSL1 Matrix metalloproteinase-7 (MMP-7) PUMP1
Type:
Enzyme
Mol. Mass.:
29681.54
Organism:
Homo sapiens (Human)
Description:
P09237
Residue:
267
  
Inhibitor
Name:
BDBM50208344
Synonyms:
4-((2-methylquinolin-4-yl)methoxy)-N-(2-((2-oxo-2,3-dihydro-1H-imidazol-5-yl)methyl)phenyl)benzamide | CHEMBL228319
Type:
Small organic molecule
Emp. Form.:
C28H24N4O3
Mol. Mass.:
464.5152
SMILES:
Cc1cc(COc2ccc(cc2)C(=O)Nc2ccccc2Cc2c[nH]c(=O)[nH]2)c2ccccc2n1
: