Target
Interstitial collagenase
Ligand
BDBM50208346
Substrate
Meas. Tech.
ChEMBL_438533 (CHEMBL887632)
Ki
>4946±n/a nM
Citation
 Sheppeck, JEGilmore, JLTebben, AXue, CBLiu, RQDecicco, CPDuan, JJ Hydantoins, triazolones, and imidazolones as selective non-hydroxamate inhibitors of tumor necrosis factor-alpha converting enzyme (TACE). Bioorg Med Chem Lett 17:2769-74 (2007)  
Target
Name:
Interstitial collagenase
Synonyms:
CLG MMP1 Matrix metalloproteinase-1 | Matrix metalloproteinase-1 (MMP-1)
Type:
Enzyme
Mol. Mass.:
54010.26
Organism:
Homo sapiens (Human)
Description:
P03956
Residue:
469
  
Inhibitor
Name:
BDBM50208346
Synonyms:
4-((2-methylquinolin-4-yl)methoxy)-N-((3R,4S)-4-(5-oxo-4,5-dihydro-1H-1,2,4-triazol-3-yl)pyrrolidin-3-yl)benzamide | CHEMBL389691
Type:
Small organic molecule
Emp. Form.:
C29H32N6O5
Mol. Mass.:
544.6016
SMILES:
Cc1cc(COc2ccc(cc2)C(=O)N[C@H]2CN(C[C@@H]2c2n[nH]c(=O)[nH]2)C(=O)OC(C)(C)C)c2ccccc2n1
: