Target
Collagenase 3
Ligand
BDBM50208347
Substrate
Meas. Tech.
ChEMBL_438532 (CHEMBL887631)
Ki
>5025±n/a nM
Citation
 Sheppeck, JEGilmore, JLTebben, AXue, CBLiu, RQDecicco, CPDuan, JJ Hydantoins, triazolones, and imidazolones as selective non-hydroxamate inhibitors of tumor necrosis factor-alpha converting enzyme (TACE). Bioorg Med Chem Lett 17:2769-74 (2007)  
Target
Name:
Collagenase 3
Synonyms:
MMP-13 MMP13_HUMAN Matrix metalloproteinase-13 (MMP-13) | Matrix metalloproteinase-13 (MMP13)
Type:
Enzyme
Mol. Mass.:
53808.06
Organism:
Homo sapiens (Human)
Description:
P45452
Residue:
471
  
Inhibitor
Name:
BDBM50208347
Synonyms:
CHEMBL229072 | N-(2-(2,5-dioxoimidazolidin-4-yl)phenyl)-4-((2-methylquinolin-4-yl)methoxy)benzamide
Type:
Small organic molecule
Emp. Form.:
C27H22N4O4
Mol. Mass.:
466.488
SMILES:
Cc1cc(COc2ccc(cc2)C(=O)Nc2ccccc2-c2[nH]c(=O)[nH]c2O)c2ccccc2n1
: