Target
72 kDa type IV collagenase
Ligand
BDBM50208346
Substrate
Meas. Tech.
ChEMBL_438528 (CHEMBL887627)
Ki
>3333±n/a nM
Citation
 Sheppeck, JEGilmore, JLTebben, AXue, CBLiu, RQDecicco, CPDuan, JJ Hydantoins, triazolones, and imidazolones as selective non-hydroxamate inhibitors of tumor necrosis factor-alpha converting enzyme (TACE). Bioorg Med Chem Lett 17:2769-74 (2007)  
Target
Name:
72 kDa type IV collagenase
Synonyms:
72 kDa gelatinase CLG4A Gelatinase A (MMP-2) MMP2_HUMAN Matrix metalloproteinase-2 (MMP 2) Matrix metalloproteinases 2 (MMP-2) | TBE-1
Type:
Enzyme
Mol. Mass.:
73870.36
Organism:
Homo sapiens (Human)
Description:
P08253
Residue:
660
  
Inhibitor
Name:
BDBM50208346
Synonyms:
4-((2-methylquinolin-4-yl)methoxy)-N-((3R,4S)-4-(5-oxo-4,5-dihydro-1H-1,2,4-triazol-3-yl)pyrrolidin-3-yl)benzamide | CHEMBL389691
Type:
Small organic molecule
Emp. Form.:
C29H32N6O5
Mol. Mass.:
544.6016
SMILES:
Cc1cc(COc2ccc(cc2)C(=O)N[C@H]2CN(C[C@@H]2c2n[nH]c(=O)[nH]2)C(=O)OC(C)(C)C)c2ccccc2n1
: