Target
Macrophage metalloelastase
Ligand
BDBM50208347
Substrate
Meas. Tech.
ChEMBL_438531 (CHEMBL887630)
Ki
782±n/a nM
Citation
 Sheppeck, JEGilmore, JLTebben, AXue, CBLiu, RQDecicco, CPDuan, JJ Hydantoins, triazolones, and imidazolones as selective non-hydroxamate inhibitors of tumor necrosis factor-alpha converting enzyme (TACE). Bioorg Med Chem Lett 17:2769-74 (2007)  
Target
Name:
Macrophage metalloelastase
Synonyms:
HME MMP12_HUMAN Matrix metalloproteinase-12 (MMP 12) Matrix metalloproteinase-12 (MMP12) | Matrix metalloproteinases 12 (MMP-12)
Type:
Enzyme
Mol. Mass.:
54012.99
Organism:
Homo sapiens (Human)
Description:
P39900
Residue:
470
  
Inhibitor
Name:
BDBM50208347
Synonyms:
CHEMBL229072 | N-(2-(2,5-dioxoimidazolidin-4-yl)phenyl)-4-((2-methylquinolin-4-yl)methoxy)benzamide
Type:
Small organic molecule
Emp. Form.:
C27H22N4O4
Mol. Mass.:
466.488
SMILES:
Cc1cc(COc2ccc(cc2)C(=O)Nc2ccccc2-c2[nH]c(=O)[nH]c2O)c2ccccc2n1
: