Target
Cathepsin S
Ligand
BDBM50208845
Substrate
Meas. Tech.
ChEMBL_443352 (CHEMBL893600)
Kd
52±n/a nM
Citation
 Bekkali, YThomson, DSBetageri, REmmanuel, MJHao, MHHickey, ELiu, WPatel, UWard, YDYoung, ERNelson, RKukulka, ABrown, MLCrane, KWhite, DFreeman, DMLabadia, MEWildeson, JSpero, DM Identification of a novel class of succinyl-nitrile-based Cathepsin S inhibitors. Bioorg Med Chem Lett 17:2465-9 (2007)  
Target
Name:
Cathepsin S
Synonyms:
CATS_HUMAN Cathepsin S (Cat S) | cathepsin S preproprotein
Type:
Protein
Mol. Mass.:
37507.38
Organism:
Homo sapiens (Human)
Description:
P25774
Residue:
331
  
Inhibitor
Name:
BDBM50208845
Synonyms:
(R)-N-(1-benzyl-4-cyanopiperidin-4-yl)-2-(cyclohexylmethyl)-4-morpholino-4-oxobutanamide | CHEMBL232682
Type:
Small organic molecule
Emp. Form.:
C28H40N4O3
Mol. Mass.:
480.6422
SMILES:
O=C(C[C@@H](CC1CCCCC1)C(=O)NC1(CCN(Cc2ccccc2)CC1)C#N)N1CCOCC1
: