Target
Peroxisome proliferator-activated receptor gamma
Ligand
BDBM50208870
Substrate
Meas. Tech.
ChEMBL_455158 (CHEMBL887188)
EC50
400±n/a nM
Citation
 Sauerberg, PMogensen, JPJeppesen, LBury, PSFleckner, JOlsen, GSJeppesen, CBWulff, EMPihera, PHavranek, MPolivka, ZPettersson, I Design of potent PPARalpha agonists. Bioorg Med Chem Lett 17:3198-202 (2007)  
Target
Name:
Peroxisome proliferator-activated receptor gamma
Synonyms:
NR1C3 PPAR-gamma PPARG_HUMAN Peroxisome proliferator-activated receptor gamma (PPAR gamma) Peroxisome proliferator-activated receptor gamma (PPARĪ³) peroxisome proliferator-activated receptor gamma isoform 2
Type:
Nuclear Receptor
Mol. Mass.:
57613.46
Organism:
Homo sapiens (Human)
Description:
P37231
Residue:
505
  
Inhibitor
Name:
BDBM50208870
Synonyms:
(S)-3-(4-(3,5-bis(trifluoromethyl)cinnamyloxy)phenyl)-2-ethoxypropanoic acid | CHEMBL248112
Type:
Small organic molecule
Emp. Form.:
C22H20F6O4
Mol. Mass.:
462.3822
SMILES:
CCO[C@@H](Cc1ccc(OC\C=C\c2cc(cc(c2)C(F)(F)F)C(F)(F)F)cc1)C(O)=O
: