Target
Cannabinoid receptor 1
Ligand
BDBM50208954
Substrate
Meas. Tech.
ChEMBL_438557 (CHEMBL887658)
Ki
25±n/a nM
Citation
 Smith, RAFathi, ZAchebe, FAkuche, CBrown, SEChoi, SFan, JJenkins, SKluender, HCKonkar, ALavoie, RMays, RNatoli, JO'Connor, SJOrtiz, AASu, NTaing, CTomlinson, STritto, TWang, GWirtz, SNWong, WYang, XFYing, SZhang, Z Optimization of imidazole amide derivatives as cannabinoid-1 receptor antagonists for the treatment of obesity. Bioorg Med Chem Lett 17:2706-11 (2007)  
Target
Name:
Cannabinoid receptor 1
Synonyms:
CANN6 CB-R CNR CNR1_HUMAN Cannabinoid receptor Cannabinoid receptor 1 (brain)
Type:
G Protein-Coupled Receptor (GPCR)
Mol. Mass.:
52868.96
Organism:
Homo sapiens (Human)
Description:
P21554
Residue:
472
  
Inhibitor
Name:
BDBM50208954
Synonyms:
1-(4-chlorophenyl)-N-cyclohexyl-2-(2,5-dichlorophenyl)-1H-imidazole-4-carboxamide | CHEMBL390544
Type:
Small organic molecule
Emp. Form.:
C22H20Cl3N3O
Mol. Mass.:
448.773
SMILES:
Clc1ccc(cc1)-n1cc(nc1-c1cc(Cl)ccc1Cl)C(=O)NC1CCCCC1
: