Target
Cannabinoid receptor 2
Ligand
BDBM50140237
Substrate
Meas. Tech.
ChEMBL_438558 (CHEMBL887659)
Ki
240±n/a nM
Citation
 Smith, RAFathi, ZAchebe, FAkuche, CBrown, SEChoi, SFan, JJenkins, SKluender, HCKonkar, ALavoie, RMays, RNatoli, JO'Connor, SJOrtiz, AASu, NTaing, CTomlinson, STritto, TWang, GWirtz, SNWong, WYang, XFYing, SZhang, Z Optimization of imidazole amide derivatives as cannabinoid-1 receptor antagonists for the treatment of obesity. Bioorg Med Chem Lett 17:2706-11 (2007)  
Target
Name:
Cannabinoid receptor 2
Synonyms:
CANNABINOID CB2 CB2 CB2B CNR2_HUMAN Cannabinoid CB2 receptor Cannabinoid receptor 2 (CB2R) | hCB2
Type:
G Protein-Coupled Receptor (GPCR)
Mol. Mass.:
39690.94
Organism:
Homo sapiens (Human)
Description:
P34972
Residue:
360
  
Inhibitor
Name:
BDBM50140237
Synonyms:
1-(4-Chloro-phenyl)-2-(2,4-dichloro-phenyl)-1H-imidazole-4-carboxylic acid cyclohexylamide CHEMBL276312
Type:
Small organic molecule
Emp. Form.:
C22H20Cl3N3O
Mol. Mass.:
448.773
SMILES:
Clc1ccc(cc1)-n1cc(nc1-c1ccc(Cl)cc1Cl)C(=O)NC1CCCCC1
: