Target
Cannabinoid receptor 1
Ligand
BDBM50208961
Substrate
Meas. Tech.
ChEMBL_438557 (CHEMBL887658)
Ki
21±n/a nM
Citation
 Smith, RAFathi, ZAchebe, FAkuche, CBrown, SEChoi, SFan, JJenkins, SKluender, HCKonkar, ALavoie, RMays, RNatoli, JO'Connor, SJOrtiz, AASu, NTaing, CTomlinson, STritto, TWang, GWirtz, SNWong, WYang, XFYing, SZhang, Z Optimization of imidazole amide derivatives as cannabinoid-1 receptor antagonists for the treatment of obesity. Bioorg Med Chem Lett 17:2706-11 (2007)  
Target
Name:
Cannabinoid receptor 1
Synonyms:
CANN6 CB-R CNR CNR1_HUMAN Cannabinoid receptor Cannabinoid receptor 1 (brain)
Type:
G Protein-Coupled Receptor (GPCR)
Mol. Mass.:
52868.96
Organism:
Homo sapiens (Human)
Description:
P21554
Residue:
472
  
Inhibitor
Name:
BDBM50208961
Synonyms:
1-(4-chlorophenyl)-N-cyclohexyl-2-o-tolyl-1H-imidazole-4-carboxamide | CHEMBL439375
Type:
Small organic molecule
Emp. Form.:
C23H24ClN3O
Mol. Mass.:
393.909
SMILES:
Cc1ccccc1-c1nc(cn1-c1ccc(Cl)cc1)C(=O)NC1CCCCC1
: