Target
Cannabinoid receptor 1
Ligand
BDBM50123692
Substrate
Meas. Tech.
ChEMBL_438557 (CHEMBL887658)
Ki
7.8±n/a nM
Citation
 Smith, RAFathi, ZAchebe, FAkuche, CBrown, SEChoi, SFan, JJenkins, SKluender, HCKonkar, ALavoie, RMays, RNatoli, JO'Connor, SJOrtiz, AASu, NTaing, CTomlinson, STritto, TWang, GWirtz, SNWong, WYang, XFYing, SZhang, Z Optimization of imidazole amide derivatives as cannabinoid-1 receptor antagonists for the treatment of obesity. Bioorg Med Chem Lett 17:2706-11 (2007)  
Target
Name:
Cannabinoid receptor 1
Synonyms:
CANN6 CB-R CNR CNR1_HUMAN Cannabinoid receptor Cannabinoid receptor 1 (brain)
Type:
G Protein-Coupled Receptor (GPCR)
Mol. Mass.:
52868.96
Organism:
Homo sapiens (Human)
Description:
P21554
Residue:
472
  
Inhibitor
Name:
BDBM50123692
Synonyms:
5-(4-Chloro-phenyl)-1-(2,4-dichloro-phenyl)-1H-pyrazole-3-carboxylic acid piperidin-1-ylamide CHEMBL160963
Type:
Small organic molecule
Emp. Form.:
C21H19Cl3N4O
Mol. Mass.:
449.761
SMILES:
Clc1ccc(cc1)-c1cc(nn1-c1ccc(Cl)cc1Cl)C(=O)NN1CCCCC1
: