Target
Cannabinoid receptor 2
Ligand
BDBM50208948
Substrate
Meas. Tech.
ChEMBL_438558 (CHEMBL887659)
Ki
2300±n/a nM
Citation
 Smith, RAFathi, ZAchebe, FAkuche, CBrown, SEChoi, SFan, JJenkins, SKluender, HCKonkar, ALavoie, RMays, RNatoli, JO'Connor, SJOrtiz, AASu, NTaing, CTomlinson, STritto, TWang, GWirtz, SNWong, WYang, XFYing, SZhang, Z Optimization of imidazole amide derivatives as cannabinoid-1 receptor antagonists for the treatment of obesity. Bioorg Med Chem Lett 17:2706-11 (2007)  
Target
Name:
Cannabinoid receptor 2
Synonyms:
CANNABINOID CB2 CB2 CB2B CNR2_HUMAN Cannabinoid CB2 receptor Cannabinoid receptor 2 (CB2R) | hCB2
Type:
G Protein-Coupled Receptor (GPCR)
Mol. Mass.:
39690.94
Organism:
Homo sapiens (Human)
Description:
P34972
Residue:
360
  
Inhibitor
Name:
BDBM50208948
Synonyms:
2-(2-chlorophenyl)-1-(4-chlorophenyl)-N-cyclohexyl-1H-imidazole-4-carboxamide | CHEMBL389175
Type:
Small organic molecule
Emp. Form.:
C22H21Cl2N3O
Mol. Mass.:
414.328
SMILES:
Clc1ccc(cc1)-n1cc(nc1-c1ccccc1Cl)C(=O)NC1CCCCC1
: