Target
C-C chemokine receptor type 1
Ligand
BDBM50208997
Substrate
Meas. Tech.
ChEMBL_443413 (CHEMBL893666)
IC50
480±n/a nM
Citation
 Brown, MFBahnck, KBBlumberg, LCBrissette, WHBurrell, SADriscoll, JPFedeles, FFisher, MBFoti, RSGladue, RPGuzman-Martinez, AHayward, MMLira, PDLillie, BMLu, YLundquist, GDMcElroy, EBMcGlynn, MAParadis, TJPoss, CSRoache, JHShavnya, AShepard, RMTrevena, KATylaska, LA Piperazinyl CCR1 antagonists--optimization of human liver microsome stability. Bioorg Med Chem Lett 17:3109-12 (2007)  
Target
Name:
C-C chemokine receptor type 1
Synonyms:
C-C CKR-1 CC-CKR-1 CCR1 CD_antigen=CD191 CMKR1 LD78 receptor Macrophage inflammatory protein 1-alpha receptor SCYAR1
Type:
Enzyme
Mol. Mass.:
41180.69
Organism:
Homo sapiens (Human)
Description:
P32246
Residue:
355
  
Inhibitor
Name:
BDBM50208997
Synonyms:
CHEMBL234606 | N-((2S,3S,5R)-5-(aminomethyl)-1-(3-fluorophenyl)-3,8-dihydroxy-8-methylnonan-2-yl)quinoxaline-2-carboxamide
Type:
Small organic molecule
Emp. Form.:
C26H33FN4O3
Mol. Mass.:
468.5636
SMILES:
CC(C)(O)CC[C@@H](CN)C[C@H](O)[C@H](Cc1cccc(F)c1)NC(=O)c1cnc2ccccc2n1
: