Target
C-C chemokine receptor type 1
Ligand
BDBM50209003
Substrate
Meas. Tech.
ChEMBL_443413 (CHEMBL893666)
IC50
23±n/a nM
Citation
 Brown, MFBahnck, KBBlumberg, LCBrissette, WHBurrell, SADriscoll, JPFedeles, FFisher, MBFoti, RSGladue, RPGuzman-Martinez, AHayward, MMLira, PDLillie, BMLu, YLundquist, GDMcElroy, EBMcGlynn, MAParadis, TJPoss, CSRoache, JHShavnya, AShepard, RMTrevena, KATylaska, LA Piperazinyl CCR1 antagonists--optimization of human liver microsome stability. Bioorg Med Chem Lett 17:3109-12 (2007)  
Target
Name:
C-C chemokine receptor type 1
Synonyms:
C-C CKR-1 CC-CKR-1 CCR1 CD_antigen=CD191 CMKR1 LD78 receptor Macrophage inflammatory protein 1-alpha receptor SCYAR1
Type:
Enzyme
Mol. Mass.:
41180.69
Organism:
Homo sapiens (Human)
Description:
P32246
Residue:
355
  
Inhibitor
Name:
BDBM50209003
Synonyms:
(2-(2-((2R,5S)-4-(4-fluorobenzyl)-2,5-dimethylpiperazin-1-yl)-2-oxoethoxy)-5-chlorophenyl)methanesulfonic acid | CHEMBL430166
Type:
Small organic molecule
Emp. Form.:
C22H26ClFN2O5S
Mol. Mass.:
484.969
SMILES:
C[C@H]1CN([C@H](C)CN1Cc1ccc(F)cc1)C(=O)COc1ccc(Cl)cc1CS(O)(=O)=O
: