Target
Liver carboxylesterase 1
Ligand
BDBM22735
Substrate
Meas. Tech.
ChEMBL_443528 (CHEMBL893785)
Ki
470±n/a nM
Citation
 Hicks, LDHyatt, JLMoak, TEdwards, CCTsurkan, LWierdl, MFerreira, AMWadkins, RMPotter, PM Analysis of the inhibition of mammalian carboxylesterases by novel fluorobenzoins and fluorobenzils. Bioorg Med Chem 15:3801-17 (2007)  
Target
Name:
Liver carboxylesterase 1
Synonyms:
Acyl coenzyme A:cholesterol acyltransferase CES1 EST1_HUMAN Serine hydrolase (CES1)
Type:
Protein
Mol. Mass.:
62520.83
Organism:
Homo sapiens (Human)
Description:
Residue:
567
  
Inhibitor
Name:
BDBM22735
Synonyms:
1,2-bis(3,4,5-trifluorophenyl)ethane-1,2-dione CHEMBL193180
Type:
Small organic molecule
Emp. Form.:
C14H4F6O2
Mol. Mass.:
318.1708
SMILES:
Fc1cc(cc(F)c1F)C(=O)C(=O)c1cc(F)c(F)c(F)c1
: