Target
Cocaine esterase
Ligand
BDBM50209411
Substrate
Meas. Tech.
ChEMBL_443527 (CHEMBL893784)
Ki
260±n/a nM
Citation
 Hicks, LDHyatt, JLMoak, TEdwards, CCTsurkan, LWierdl, MFerreira, AMWadkins, RMPotter, PM Analysis of the inhibition of mammalian carboxylesterases by novel fluorobenzoins and fluorobenzils. Bioorg Med Chem 15:3801-17 (2007)  
Target
Name:
Cocaine esterase
Synonyms:
CES2 EST2_HUMAN | ICE
Type:
PROTEIN
Mol. Mass.:
61801.08
Organism:
Homo sapiens (Human)
Description:
ChEMBL_1494240
Residue:
559
  
Inhibitor
Name:
BDBM50209411
Synonyms:
1,2-bis(2,3-difluorophenyl)-2-hydroxyethanone | CHEMBL244427
Type:
Small organic molecule
Emp. Form.:
C14H8F4O2
Mol. Mass.:
284.2057
SMILES:
OC(C(=O)c1cccc(F)c1F)c1cccc(F)c1F
: