Target
Liver carboxylesterase 1
Ligand
BDBM50209411
Substrate
Meas. Tech.
ChEMBL_443528 (CHEMBL893785)
Ki
730±n/a nM
Citation
 Hicks, LDHyatt, JLMoak, TEdwards, CCTsurkan, LWierdl, MFerreira, AMWadkins, RMPotter, PM Analysis of the inhibition of mammalian carboxylesterases by novel fluorobenzoins and fluorobenzils. Bioorg Med Chem 15:3801-17 (2007)  
Target
Name:
Liver carboxylesterase 1
Synonyms:
Acyl coenzyme A:cholesterol acyltransferase CES1 EST1_HUMAN Serine hydrolase (CES1)
Type:
Protein
Mol. Mass.:
62520.83
Organism:
Homo sapiens (Human)
Description:
Residue:
567
  
Inhibitor
Name:
BDBM50209411
Synonyms:
1,2-bis(2,3-difluorophenyl)-2-hydroxyethanone | CHEMBL244427
Type:
Small organic molecule
Emp. Form.:
C14H8F4O2
Mol. Mass.:
284.2057
SMILES:
OC(C(=O)c1cccc(F)c1F)c1cccc(F)c1F
: