Target
Cocaine esterase
Ligand
BDBM50209405
Substrate
Meas. Tech.
ChEMBL_443527 (CHEMBL893784)
Ki
250±n/a nM
Citation
 Hicks, LDHyatt, JLMoak, TEdwards, CCTsurkan, LWierdl, MFerreira, AMWadkins, RMPotter, PM Analysis of the inhibition of mammalian carboxylesterases by novel fluorobenzoins and fluorobenzils. Bioorg Med Chem 15:3801-17 (2007)  
Target
Name:
Cocaine esterase
Synonyms:
CES2 EST2_HUMAN | ICE
Type:
PROTEIN
Mol. Mass.:
61801.08
Organism:
Homo sapiens (Human)
Description:
ChEMBL_1494240
Residue:
559
  
Inhibitor
Name:
BDBM50209405
Synonyms:
1,2-bis[3-(trifluoromethyl)phenyl]ethane-1,2-dione | CHEMBL395019
Type:
Small organic molecule
Emp. Form.:
C16H8F6O2
Mol. Mass.:
346.2239
SMILES:
FC(F)(F)c1cccc(c1)C(=O)C(=O)c1cccc(c1)C(F)(F)F
: