Target
Cocaine esterase
Ligand
BDBM50209416
Substrate
Meas. Tech.
ChEMBL_443527 (CHEMBL893784)
Ki
40.7±n/a nM
Citation
 Hicks, LDHyatt, JLMoak, TEdwards, CCTsurkan, LWierdl, MFerreira, AMWadkins, RMPotter, PM Analysis of the inhibition of mammalian carboxylesterases by novel fluorobenzoins and fluorobenzils. Bioorg Med Chem 15:3801-17 (2007)  
Target
Name:
Cocaine esterase
Synonyms:
CES2 EST2_HUMAN | ICE
Type:
PROTEIN
Mol. Mass.:
61801.08
Organism:
Homo sapiens (Human)
Description:
ChEMBL_1494240
Residue:
559
  
Inhibitor
Name:
BDBM50209416
Synonyms:
1,2-bis(2,3,6-trifluorophenyl)ethane-1,2-dione | CHEMBL242722
Type:
Small organic molecule
Emp. Form.:
C14H4F6O2
Mol. Mass.:
318.1708
SMILES:
Fc1cc(F)c(F)c(c1)C(=O)C(=O)c1c(F)ccc(F)c1F
: