Target
Liver carboxylesterase 1
Ligand
BDBM50209410
Substrate
Meas. Tech.
ChEMBL_443528 (CHEMBL893785)
Ki
260±n/a nM
Citation
 Hicks, LDHyatt, JLMoak, TEdwards, CCTsurkan, LWierdl, MFerreira, AMWadkins, RMPotter, PM Analysis of the inhibition of mammalian carboxylesterases by novel fluorobenzoins and fluorobenzils. Bioorg Med Chem 15:3801-17 (2007)  
Target
Name:
Liver carboxylesterase 1
Synonyms:
Acyl coenzyme A:cholesterol acyltransferase CES1 EST1_HUMAN Serine hydrolase (CES1)
Type:
Protein
Mol. Mass.:
62520.83
Organism:
Homo sapiens (Human)
Description:
Residue:
567
  
Inhibitor
Name:
BDBM50209410
Synonyms:
1,2-bis(2,3,4-trifluorophenyl)-2-hydroxyethanone | CHEMBL244631
Type:
Small organic molecule
Emp. Form.:
C14H6F6O2
Mol. Mass.:
320.1867
SMILES:
OC(C(=O)c1ccc(F)c(F)c1F)c1ccc(F)c(F)c1F
: