Target
Cocaine esterase
Ligand
BDBM50209399
Substrate
Meas. Tech.
ChEMBL_443527 (CHEMBL893784)
Ki
150±n/a nM
Citation
 Hicks, LDHyatt, JLMoak, TEdwards, CCTsurkan, LWierdl, MFerreira, AMWadkins, RMPotter, PM Analysis of the inhibition of mammalian carboxylesterases by novel fluorobenzoins and fluorobenzils. Bioorg Med Chem 15:3801-17 (2007)  
Target
Name:
Cocaine esterase
Synonyms:
CES2 EST2_HUMAN | ICE
Type:
PROTEIN
Mol. Mass.:
61801.08
Organism:
Homo sapiens (Human)
Description:
ChEMBL_1494240
Residue:
559
  
Inhibitor
Name:
BDBM50209399
Synonyms:
1,2-bis(3,4-difluorophenyl)ethane-1,2-dione | CHEMBL397739
Type:
Small organic molecule
Emp. Form.:
C14H6F4O2
Mol. Mass.:
282.1899
SMILES:
Fc1ccc(cc1F)C(=O)C(=O)c1ccc(F)c(F)c1
: