Target
Cocaine esterase
Ligand
BDBM22735
Substrate
Meas. Tech.
ChEMBL_443527 (CHEMBL893784)
Ki
360±n/a nM
Citation
 Hicks, LDHyatt, JLMoak, TEdwards, CCTsurkan, LWierdl, MFerreira, AMWadkins, RMPotter, PM Analysis of the inhibition of mammalian carboxylesterases by novel fluorobenzoins and fluorobenzils. Bioorg Med Chem 15:3801-17 (2007)  
Target
Name:
Cocaine esterase
Synonyms:
CES2 EST2_HUMAN | ICE
Type:
PROTEIN
Mol. Mass.:
61801.08
Organism:
Homo sapiens (Human)
Description:
ChEMBL_1494240
Residue:
559
  
Inhibitor
Name:
BDBM22735
Synonyms:
1,2-bis(3,4,5-trifluorophenyl)ethane-1,2-dione CHEMBL193180
Type:
Small organic molecule
Emp. Form.:
C14H4F6O2
Mol. Mass.:
318.1708
SMILES:
Fc1cc(cc(F)c1F)C(=O)C(=O)c1cc(F)c(F)c(F)c1
: