Target
Liver carboxylesterase 1
Ligand
BDBM50209421
Substrate
Meas. Tech.
ChEMBL_443528 (CHEMBL893785)
Ki
190±n/a nM
Citation
 Hicks, LDHyatt, JLMoak, TEdwards, CCTsurkan, LWierdl, MFerreira, AMWadkins, RMPotter, PM Analysis of the inhibition of mammalian carboxylesterases by novel fluorobenzoins and fluorobenzils. Bioorg Med Chem 15:3801-17 (2007)  
Target
Name:
Liver carboxylesterase 1
Synonyms:
Acyl coenzyme A:cholesterol acyltransferase CES1 EST1_HUMAN Serine hydrolase (CES1)
Type:
Protein
Mol. Mass.:
62520.83
Organism:
Homo sapiens (Human)
Description:
Residue:
567
  
Inhibitor
Name:
BDBM50209421
Synonyms:
1,2-bis(2,6-difluorophenyl)-2-hydroxyethanone | CHEMBL244426
Type:
Small organic molecule
Emp. Form.:
C14H8F4O2
Mol. Mass.:
284.2057
SMILES:
OC(C(=O)c1c(F)cccc1F)c1c(F)cccc1F
: