Target
Acetylcholinesterase
Ligand
BDBM22728
Substrate
Meas. Tech.
ChEMBL_443530 (CHEMBL893787)
Ki
>100000±n/a nM
Citation
 Hicks, LDHyatt, JLMoak, TEdwards, CCTsurkan, LWierdl, MFerreira, AMWadkins, RMPotter, PM Analysis of the inhibition of mammalian carboxylesterases by novel fluorobenzoins and fluorobenzils. Bioorg Med Chem 15:3801-17 (2007)  
Target
Name:
Acetylcholinesterase
Synonyms:
ACES_HUMAN Acetylcholinesterase (AChE) | Acetylcholinesterase (human AChE)
Type:
Enzyme
Mol. Mass.:
67792.70
Organism:
Homo sapiens (Human)
Description:
P22303
Residue:
614
  
Inhibitor
Name:
BDBM22728
Synonyms:
2-hydroxy-1,2-diphenylethan-1-one CHEMBL190677
Type:
Small organic molecule
Emp. Form.:
C14H12O2
Mol. Mass.:
212.2439
SMILES:
OC(C(=O)c1ccccc1)c1ccccc1
: