Target
Integrin alpha-V/beta-3
Ligand
BDBM50209464
Substrate
Meas. Tech.
ChEMBL_443533 (CHEMBL893790)
IC50
7±n/a nM
Citation
 Nagarajan, SRDevadas, BMalecha, JWLu, HFRuminski, PGRico, JGRogers, TEMarrufo, LDCollins, JTKleine, HPLantz, MKZhu, JGreen, NFRussell, MALandis, BHMiller, LMMeyer, DMDuffin, TDEngleman, VWFinn, MBFreeman, SKGriggs, DWWilliams, MLNickols, MAPegg, JAShannon, KESteininger, CWestlin, MMNickols, GAKeene, JL R-isomers of Arg-Gly-Asp (RGD) mimics as potent alphavbeta3 inhibitors. Bioorg Med Chem 15:3783-800 (2007)  
Target
Name:
Integrin alpha-V/beta-3
Synonyms:
ITGAV/ITGB3 | Integrin beta-3/Vitronectin receptor alpha
Type:
Enzyme
Mol. Mass.:
Description:
Components:
This complex has 2 components.
Component 1
Name:
Integrin alpha-V
Synonyms:
ITAV_HUMAN Integrin alpha-V/alpha-5 VNRA Vitronectin receptor | Vitronectin receptor subunit alpha
Type:
PROTEIN
Mol. Mass.:
116024.92
Organism:
Homo sapiens (Human)
Description:
ChEMBL_582336
Residue:
1048
  
Component 2
Name:
Integrin beta-3
Synonyms:
CD_antigen=CD61 GPIIIa ITGB3 Platelet membrane glycoprotein IIIa
Type:
Protein
Mol. Mass.:
87038.91
Organism:
Homo sapiens (Human)
Description:
P05106
Residue:
788
  
Inhibitor
Name:
BDBM50209464
Synonyms:
(3R)-3-(2-(3-amino-5-(5-hydroxy-1,4,5,6-tetrahydropyrimidin-2-ylamino)benzamido)acetamido)-3-(3,5-dibromo-2-hydroxyphenyl)propanoic acid | CHEMBL244847
Type:
Small organic molecule
Emp. Form.:
C22H24Br2N6O6
Mol. Mass.:
628.271
SMILES:
[#7]-c1cc(cc(c1)-[#6](=O)-[#7]-[#6]-[#6](=O)-[#7]-[#6@H](-[#6]-[#6](-[#8])=O)-c1cc(Br)cc(Br)c1-[#8])\[#7]=[#6]-1\[#7]-[#6]-[#6](-[#8])-[#6]-[#7]-1
: