Target
Cytochrome P450 2C9
Ligand
BDBM50209505
Substrate
Meas. Tech.
ChEMBL_443555 (CHEMBL893812)
IC50
2080±n/a nM
Citation
 Labrie, PMaddaford, SPLacroix, JCatalano, CLee, DKRakhit, SGaudreault, RC In vitro activity of novel dual action MDR anthranilamide modulators with inhibitory activity on CYP-450 (Part 2). Bioorg Med Chem 15:3854-68 (2007)  
Target
Name:
Cytochrome P450 2C9
Synonyms:
(R)-limonene 6-monooxygenase CP2C9_HUMAN CYP2C9 Cytochrome P450 2C9 (CYP2C9 ) P-450MP P450 PB-1 | S-mephenytoin 4-hydroxylase
Type:
Enzyme
Mol. Mass.:
55636.33
Organism:
Homo sapiens (Human)
Description:
P11712
Residue:
490
  
Inhibitor
Name:
BDBM50209505
Synonyms:
CHEMBL244239 | N-(2-((2-((3,4-dimethoxyphenethyl)(methyl)amino)ethyl)carbamoyl)phenyl)quinoline-3-carboxamide
Type:
Small organic molecule
Emp. Form.:
C30H32N4O4
Mol. Mass.:
512.5995
SMILES:
COc1ccc(CCN(C)CCNC(=O)c2ccccc2NC(=O)c2cnc3ccccc3c2)cc1OC
: