Target
Dipeptidyl peptidase 4
Ligand
BDBM50209951
Substrate
Meas. Tech.
ChEMBL_443904 (CHEMBL893070)
IC50
3730±n/a nM
Citation
 Lübbers, TBöhringer, MGobbi, LHennig, MHunziker, DKuhn, BLöffler, BMattei, PNarquizian, RPeters, JURuff, YWessel, HPWyss, P 1,3-disubstituted 4-aminopiperidines as useful tools in the optimization of the 2-aminobenzo[a]quinolizine dipeptidyl peptidase IV inhibitors. Bioorg Med Chem Lett 17:2966-70 (2007)  
Target
Name:
Dipeptidyl peptidase 4
Synonyms:
ADABP Adenosine deaminase complexing protein 2 CD_antigen=CD26 DPP4 DPPIV Dipeptidyl peptidase 4 (DPP IV) Dipeptidyl peptidase 4 (DPP4) Dipeptidyl peptidase 4 membrane form Dipeptidyl peptidase IV Dipeptidyl peptidase IV (DDP-IV) Dipeptidyl peptidase IV membrane form Dipeptidyl peptidase-IV (DPP-4) T-cell activation antigen CD26 | TP103
Type:
Enzyme
Mol. Mass.:
88271.01
Organism:
Homo sapiens (Human)
Description:
P27487
Residue:
766
  
Inhibitor
Name:
BDBM50209951
Synonyms:
(2S,3S,11bS)-3-(3,4-dimethylphenyl)-9,10-dimethoxy-2,3,4,6,7,11b-hexahydro-1H-pyrido[2,1-a]isoquinolin-2-amine | CHEMBL392085
Type:
Small organic molecule
Emp. Form.:
C23H30N2O2
Mol. Mass.:
366.4965
SMILES:
COc1cc2CCN3C[C@@H]([C@@H](N)C[C@H]3c2cc1OC)c1ccc(C)c(C)c1
: