Target
Potassium voltage-gated channel subfamily H member 2
Ligand
BDBM50209974
Substrate
Meas. Tech.
ChEMBL_458983 (CHEMBL925077)
IC50
6000±n/a nM
Citation
 Pruitt, JRBatt, DGWacker, DABostrom, LLBooker, SKMcLaughlin, EHoughton, GCVarnes, JGChrist, DDCovington, MDas, AMDavies, PGraden, DKariv, IOrlovsky, YStowell, NCVaddi, KGWadman, EAWelch, PKYeleswaram, SSolomon, KANewton, RCDecicco, CPCarter, PHKo, SS CC chemokine receptor-3 (CCR3) antagonists: improving the selectivity of DPC168 by reducing central ring lipophilicity. Bioorg Med Chem Lett 17:2992-7 (2007)  
Target
Name:
Potassium voltage-gated channel subfamily H member 2
Synonyms:
1,3-beta-glucan synthase component GLS2 ERG Eag-related protein 1 Ether-a-go-go-related gene (HERG) Ether-a-go-go-related gene potassium channel 1 Ether-a-go-go-related gene potassium channel 1 (hERG1) Ether-a-go-go-related protein 1 H-ERG KCNH2 Potassium voltage-gated channel subfamily H member 2 (hERG) Voltage-gated potassium channel subunit Kv11.1 hERG Potassium Channel 1 | putative potassium channel subunit
Type:
Multi-pass membrane protein
Mol. Mass.:
126672.65
Organism:
Homo sapiens (Human)
Description:
Q12809
Residue:
1159
  
Inhibitor
Name:
BDBM50209974
Synonyms:
1-((3S,4S)-4-(((S)-3-(4-fluorobenzyl)piperidin-1-yl)methyl)-1-acetylpiperidin-3-yl)-3-(5-acetyl-4-methylthiazol-2-yl)urea | CHEMBL249854
Type:
Small organic molecule
Emp. Form.:
C27H36FN5O3S
Mol. Mass.:
529.67
SMILES:
CC(=O)N1CC[C@@H](CN2CCC[C@@H](Cc3ccc(F)cc3)C2)[C@@H](C1)NC(=O)Nc1nc(C)c(s1)C(C)=O
: