Target
cGMP-dependent protein kinase
Ligand
BDBM50210473
Substrate
Meas. Tech.
ChEMBL_455393 (CHEMBL886170)
IC50
0.06±n/a nM
Citation
 Scribner, ADennis, RHong, JLee, SMcIntyre, DPerrey, DFeng, DFisher, MWyvratt, MLeavitt, PLiberator, PGurnett, ABrown, CMathew, JThompson, DSchmatz, DBiftu, T Synthesis and biological activity of imidazopyridine anticoccidial agents: part I. Eur J Med Chem 42:1334-57 (2007)  
Target
Name:
cGMP-dependent protein kinase
Synonyms:
Type:
PROTEIN
Mol. Mass.:
112911.27
Organism:
Eimeria tenella
Description:
ChEMBL_469577
Residue:
1003
  
Inhibitor
Name:
BDBM50210473
Synonyms:
(3,4-difluorobenzyl)-{4-[7-dimethylaminomethyl-2-(4-fluorophenyl)imidazo[1,2-a]pyridin-3-yl]pyrimidin-2-yl}amine | CHEMBL400908
Type:
Small organic molecule
Emp. Form.:
C27H23F3N6
Mol. Mass.:
488.5069
SMILES:
CN(C)Cc1ccn2c(c(nc2c1)-c1ccc(F)cc1)-c1ccnc(NCc2ccc(F)c(F)c2)n1
: