Target
Kappa-type opioid receptor
Ligand
BDBM50135800
Substrate
Meas. Tech.
ChEMBL_444084 (CHEMBL893247)
EC50
0.190000±n/a nM
Citation
 Peng, XKnapp, BIBidlack, JMNeumeyer, JL In-vitro investigation of oxazol and urea analogues of morphinan at opioid receptors. Bioorg Med Chem 15:4106-12 (2007)  
Target
Name:
Kappa-type opioid receptor
Synonyms:
K-OR-1 Kappa-opioid receptor (KOR) Kappa-type opioid receptor (KOR) OPIATE Kappa OPRK1 kappa opioid receptor (KOR)
Type:
G Protein-Coupled Receptor (GPCR)
Mol. Mass.:
42648.76
Organism:
Homo sapiens (Human)
Description:
P41145
Residue:
380
  
Inhibitor
Name:
BDBM50135800
Synonyms:
(-)-3-Hydroxy-N-cycloproypylmethylmorphinan Mandelate 3-Hydroxy-N-cyclopropylmethylmorphinan CYCLORPHAN US10736890, Compound TABLE B.6 US9656961, Example 00123
Type:
Small organic molecule
Emp. Form.:
C20H27NO
Mol. Mass.:
297.4345
SMILES:
Oc1ccc2C[C@@H]3[C@@H]4CCCC[C@]4(CCN3CC3CC3)c2c1
: