Target
Thymidine kinase
Ligand
BDBM50211001
Substrate
Meas. Tech.
ChEMBL_455486 (CHEMBL886265)
IC50
4200±n/a nM
Citation
 Chitneni, SKDeroose, CMFonge, HGijsbers, RDyubankova, NBalzarini, JDebyser, ZMortelmans, LVerbruggen, AMBormans, GM Synthesis and biological evaluation of an 123I-labeled bicyclic nucleoside analogue (BCNA) as potential SPECT tracer for VZV-tk reporter gene imaging. Bioorg Med Chem Lett 17:3458-62 (2007)  
Target
Name:
Thymidine kinase
Synonyms:
KITH_VZVD | TK
Type:
PROTEIN
Mol. Mass.:
37819.99
Organism:
Varicella-zoster virus (strain Dumas) (HHV-3) (Human herpesvirus 3)
Description:
ChEMBL_444706
Residue:
341
  
Inhibitor
Name:
BDBM50211001
Synonyms:
6-(3-hydroxy-4-iodophenyl)-3-((2R,4S,5R)-4-hydroxy-5-(hydroxymethyl)-tetrahydrofuran-2-yl)furo[2,3-d]pyrimidin-2(3H)-one | CHEMBL248320
Type:
Small organic molecule
Emp. Form.:
C17H15IN2O6
Mol. Mass.:
470.2153
SMILES:
OC[C@H]1O[C@H](C[C@@H]1O)n1cc2cc(oc2nc1=O)-c1ccc(I)c(O)c1
: