Target
Melanocortin receptor 3
Ligand
BDBM50211390
Substrate
Meas. Tech.
ChEMBL_434964 (CHEMBL919365)
IC50
>10000±n/a nM
Citation
 Bednarek, MAMacNeil, TTang, RFong, TMCabello, MAMaroto, MTeran, A Potent and selective agonists of human melanocortin receptor 5: cyclic analogues of alpha-melanocyte-stimulating hormone. J Med Chem 50:2520-6 (2007)  
Target
Name:
Melanocortin receptor 3
Synonyms:
MC3-R MC3R_HUMAN Melanocortin receptor (M3 and M4)
Type:
Enzyme
Mol. Mass.:
36044.86
Organism:
Homo sapiens (Human)
Description:
P41968
Residue:
323
  
Inhibitor
Name:
BDBM50211390
Synonyms:
Ac-Nle4-cyclo(Asp5-His6-D-Tyr-Pro8-Trp9-Lys10)-NH2 | CHEMBL373726
Type:
Small organic molecule
Emp. Form.:
C49H64N12O10
Mol. Mass.:
981.1069
SMILES:
CCCC[C@H](NC(C)=O)C(=O)N[C@H]1CC(=O)NCCCC[C@H](NC(=O)[C@H](Cc2cc3ccccc3[nH]2)NC(=O)[C@@H]2CCCN2C(=O)[C@@H](Cc2ccc(O)cc2)NC(=O)[C@H](Cc2cnc[nH]2)NC1=O)C(N)=O
: