Target
Glutamate receptor 1
Ligand
BDBM50166285
Substrate
Meas. Tech.
ChEMBL_435002 (CHEMBL920803)
Ki
5.2±n/a nM
Citation
 Vogensen, SBFrydenvang, KGreenwood, JRPostorino, GNielsen, BPickering, DSEbert, BBølcho, UEgebjerg, JGajhede, MKastrup, JSJohansen, TNClausen, RPKrogsgaard-Larsen, P A tetrazolyl-substituted subtype-selective AMPA receptor agonist. J Med Chem 50:2408-14 (2007)  
Target
Name:
Glutamate receptor 1
Synonyms:
AMPA-selective glutamate receptor 1 GluA1 GluR-A Glur1 Gria1
Type:
Protein
Mol. Mass.:
101583.91
Organism:
Rattus norvegicus (Rat)
Description:
P19490
Residue:
907
  
Inhibitor
Name:
BDBM50166285
Synonyms:
(RS)-2-amino-3-[3-hydroxy-5-(2-propyl-2H-5-tetrazolyl)-4-isoxazolyl]propionic acid 2-amino-3-(3-hydroxy-5-(2-propyl-2H-tetrazol-5-yl)isoxazol-4-yl)propanoic acid | CHEMBL372643
Type:
Small organic molecule
Emp. Form.:
C10H14N6O4
Mol. Mass.:
282.256
SMILES:
CCCn1nnc(n1)-c1o[nH]c(=O)c1CC(N)C(O)=O
: